{"text_format":"1","workbook":"xlsx","n_sheets":8,"sheets":["はじめに","変更履歴","1.リソース設定（必須）","2.特性設定（任意）","3.関連機能設定（任意）","4.パラメータ設定（任意）","入力チェック","(設定シート管理用)リスト"],"not_rendered":{"charts":0,"images":1,"macros":1,"external_links":1,"defined_names":1,"comments":1,"pivot_tables":0},"unopened":[],"bounds":{"document_bytes":16777216,"sheet_cells":100000,"rows_first":2000,"rows_last":500,"rows_between":2000,"halvings":0,"cell_chars":16384,"cell_head_chars":4096},"cells_cut":0,"cells_raw":0,"read":"whole","date_system":"1900"}

{"sheet":"はじめに","index":0,"n_rows":48,"n_cols":5,"rows_kept":48,"cut":false,"hidden":false,"merged":[[5,1,5,2],[5,4,5,10],[6,1,6,2],[6,4,6,10],[2,1,2,2],[2,4,2,10],[3,1,3,2],[3,4,3,10],[4,1,4,2],[4,4,4,10]]}
[]
["＜リソース情報 設定シートの記入の仕方＞"]
[null,"シート名",null,"必須/任意","説明"]
[null,"1.リソース設定（必須）",null,"必須","リソース登録に必要なテンプレートの情報と、登録するリソースの情報を記入します。\n設定可能は項目数は最大100となっておりますが、100を超える場合はご相談ください。"]
[null,"2.特性設定（任意）",null,"任意","テンプレートに付随する特性を使用する場合、記入が必要となります。\n設定可能な特性は最大100となっておりますが、100を超える場合はご相談ください。"]
[null,"3.関連機能設定（任意）",null,"任意","関連機能を使用する場合、記入が必要となります。"]
[null,"4.パラメータ設定（任意）",null,"任意","パラメータを利用する場合、記入が必要となります。"]
[]
[]
["＜xmlの中身の生成＞"]
[null,"①「XML出力」ボタンを押下し、保存します"]
[]
["＜入力チェックのプルダウンに項目を追加する手順＞"]
[null,"①入力チェックシートのA列にプルダウンで表示される項目名を入力します"]
[null,"②入力チェックシートのC列に正規表現を入力します"]
{"$rows_left_out":34}
{"sheet":"変更履歴","index":1,"n_rows":8,"n_cols":5,"rows_kept":8,"cut":false,"hidden":false,"merged":[]}
["<変更履歴>"]
[]
[null,"Ver","更新日","更新シート","更新内容"]
[null,1,"2021-08-26",null,"新規作成"]
[null,1,"2021-09-13","はじめに","＜商品概念図＞を追加\n\n＜商品設定フロー＞を追加"]
[null,1,"2021-09-15","1.リソース設定（必須）","以下の項目のヘッダ名を変更\n・未設定の場合の属性の値→リソース一覧でのフィルタ値\n・検索可否→追加フィルタとしての使用可否"]
[null,"1.0.1","2021-10-11","3.関連機能設定（任意）","提供キー情報を追加"]
[null,"1.0.1","2022-02-02","入力チェック","以下の正規表現を変更\n・郵便番号（ハイフンなし）"]

{"sheet":"1.リソース設定（必須）","index":2,"n_rows":195,"n_cols":48,"rows_kept":195,"cut":false,"hidden":false,"merged":[[1,2,1,3]]}
[]
[null,null,"色の凡例"]
[null,null,"必須","任意"]
[]
["テンプレート設定",{"$f":"HYPERLINK(\"#A\"&ROW($A161),\"記入例はこちら\")","v":"記入例はこちら"}]
["<displayName>","<key>","<description>"]
["</displayName>","</key>","</description>"]
["テンプレート表示名\n※全角半角64文字まで","テンプレートキー情報\n※半角32文字まで","テンプレート説明\n※全角半角1024文字まで",null,null,null,null,null,null,null,null,null,null,null,null,null,null,null,null,null,null,null,null,null,null,null,"テンプレート"]
[null,null,null,null,null,null,null,null,null,null,null,null,null,null,null,null,null,null,null,null,null,null,null,null,null,null,{"$f":"CONCATENATE($B$6,$B$9,$B$7,$C$6,$C$9,$C$7,$A$6,$A$9,$A$7)","v":"<key></key><description></description><displayName></displayName>"}]
[]
["プロビジョニング設定"]
["<resourceActions>","</resourceActions>","<resourceAction>","</resourceAction>"]
["<targetSystem>"]
["</targetSystem>","<resourceProvisioningTypeKey>NEW</resourceProvisioningTypeKey>","<resourceProvisioningTypeKey>UPDATE</resourceProvisioningTypeKey>","<resourceProvisioningTypeKey>TERMINATE</resourceProvisioningTypeKey>"]
["<resourcePath>",{"$f":"IF(NOT(ISBLANK(B$18)),VLOOKUP(B$18,'(設定シート管理用)リスト'!$AA:$AB,2,FALSE),\"\")","v":"<resourceProvisioningMethod>task</resourceProvisioningMethod>"},{"$f":"IF(NOT(ISBLANK(C$18)),VLOOKUP(C$18,'(設定シート管理用)リスト'!$AA:$AB,2,FALSE),\"\")","v":"<resourceProvisioningMethod>task</resourceProvisioningMethod>"},{"$f":"IF(NOT(ISBLANK(D$18)),VLOOKUP(D$18,'(設定シート管理用)リスト'!$AA:$AB,2,FALSE),\"\")","v":"<resourceProvisioningMethod>task</resourceProvisioningMethod>"}]
{"$rows_left_out":181}
{"sheet":"2.特性設定（任意）","index":3,"n_rows":125,"n_cols":11,"rows_kept":125,"cut":false,"hidden":false,"merged":[[0,2,0,3]]}
["特性を使用する場合の設定シート",null,"色の凡例"]
[null,null,"必須","任意"]
[]
["特性設定",{"$f":"HYPERLINK(\"#A\"&ROW($A116),\"記入例はこちら\")","v":"記入例はこちら"}]
["<displayOrder>","<displayName>","<characteristicKey>","<description>","<defaultValue>"]
["</displayOrder>","</displayName>","</characteristicKey>","</description>","</defaultValue>"]
["表示順","特性表示名\n※全角半角64文字まで","特性キー情報\n※半角32文字まで","説明\n※全角半角1024文字まで","デフォルト値\n※全角半角128文字まで","オーダ完了後の値変更","検索可否","入力の必須・任意",null,null,"特性結合列"]
[1,null,null,null,null,"変更可","検索不可","必須",null,null,{"$f":"IF(COUNTA($A8:$C8,$F8:$H8)=6,CONCATENATE(VLOOKUP($F8,'(設定シート管理用)リスト'!$Q:$R,2,FALSE),VLOOKUP($G8,'(設定シート管理用)リスト'!$S:$T,2,FALSE),VLOOKUP($H8,'(設定シート管理用)リスト'!$U:$V,2,FALSE),$C$5,$C8,$C$6,$B$5,$B8,$B$6,$A$5,$A8,$A$6,IF(ISBLANK($D8),\"\",CONCATENATE($D$5,$D8,$D$6)),IF(ISBLANK($E8),\"\",CONCATENATE($E$5,$E8,$E$6)),\"</characteristic>\"),\"\")","v":""}]
[2,null,null,null,null,"変更可","検索不可","必須",null,null,{"$f":"IF(COUNTA($A9:$C9,$F9:$H9)=6,CONCATENATE(VLOOKUP($F9,'(設定シート管理用)リスト'!$Q:$R,2,FALSE),VLOOKUP($G9,'(設定シート管理用)リスト'!$S:$T,2,FALSE),VLOOKUP($H9,'(設定シート管理用)リスト'!$U:$V,2,FALSE),$C$5,$C9,$C$6,$B$5,$B9,$B$6,$A$5,$A9,$A$6,IF(ISBLANK($D9),\"\",CONCATENATE($D$5,$D9,$D$6)),IF(ISBLANK($E9),\"\",CONCATENATE($E$5,$E9,$E$6)),\"</characteristic>\"),\"\")","v":""}]
[3,null,null,null,null,"変更可","検索不可","必須",null,null,{"$f":"IF(COUNTA($A10:$C10,$F10:$H10)=6,CONCATENATE(VLOOKUP($F10,'(設定シート管理用)リスト'!$Q:$R,2,FALSE),VLOOKUP($G10,'(設定シート管理用)リスト'!$S:$T,2,FALSE),VLOOKUP($H10,'(設定シート管理用)リスト'!$U:$V,2,FALSE),$C$5,$C10,$C$6,$B$5,$B10,$B$6,$A$5,$A10,$A$6,IF(ISBLANK($D10),\"\",CONCATENATE($D$5,$D10,$D$6)),IF(ISBLANK($E10),\"\",CONCATENATE($E$5,$E10,$E$6)),\"</characteristic>\"),\"\")","v":""}]
[4,null,null,null,null,"変更可","検索不可","必須",null,null,{"$f":"IF(COUNTA($A11:$C11,$F11:$H11)=6,CONCATENATE(VLOOKUP($F11,'(設定シート管理用)リスト'!$Q:$R,2,FALSE),VLOOKUP($G11,'(設定シート管理用)リスト'!$S:$T,2,FALSE),VLOOKUP($H11,'(設定シート管理用)リスト'!$U:$V,2,FALSE),$C$5,$C11,$C$6,$B$5,$B11,$B$6,$A$5,$A11,$A$6,IF(ISBLANK($D11),\"\",CONCATENATE($D$5,$D11,$D$6)),IF(ISBLANK($E11),\"\",CONCATENATE($E$5,$E11,$E$6)),\"</characteristic>\"),\"\")","v":""}]
[5,null,null,null,null,"変更可","検索不可","必須",null,null,{"$f":"IF(COUNTA($A12:$C12,$F12:$H12)=6,CONCATENATE(VLOOKUP($F12,'(設定シート管理用)リスト'!$Q:$R,2,FALSE),VLOOKUP($G12,'(設定シート管理用)リスト'!$S:$T,2,FALSE),VLOOKUP($H12,'(設定シート管理用)リスト'!$U:$V,2,FALSE),$C$5,$C12,$C$6,$B$5,$B12,$B$6,$A$5,$A12,$A$6,IF(ISBLANK($D12),\"\",CONCATENATE($D$5,$D12,$D$6)),IF(ISBLANK($E12),\"\",CONCATENATE($E$5,$E12,$E$6)),\"</characteristic>\"),\"\")","v":""}]
[6,null,null,null,null,"変更可","検索不可","必須",null,null,{"$f":"IF(COUNTA($A13:$C13,$F13:$H13)=6,CONCATENATE(VLOOKUP($F13,'(設定シート管理用)リスト'!$Q:$R,2,FALSE),VLOOKUP($G13,'(設定シート管理用)リスト'!$S:$T,2,FALSE),VLOOKUP($H13,'(設定シート管理用)リスト'!$U:$V,2,FALSE),$C$5,$C13,$C$6,$B$5,$B13,$B$6,$A$5,$A13,$A$6,IF(ISBLANK($D13),\"\",CONCATENATE($D$5,$D13,$D$6)),IF(ISBLANK($E13),\"\",CONCATENATE($E$5,$E13,$E$6)),\"</characteristic>\"),\"\")","v":""}]
[7,null,null,null,null,"変更可","検索不可","必須",null,null,{"$f":"IF(COUNTA($A14:$C14,$F14:$H14)=6,CONCATENATE(VLOOKUP($F14,'(設定シート管理用)リスト'!$Q:$R,2,FALSE),VLOOKUP($G14,'(設定シート管理用)リスト'!$S:$T,2,FALSE),VLOOKUP($H14,'(設定シート管理用)リスト'!$U:$V,2,FALSE),$C$5,$C14,$C$6,$B$5,$B14,$B$6,$A$5,$A14,$A$6,IF(ISBLANK($D14),\"\",CONCATENATE($D$5,$D14,$D$6)),IF(ISBLANK($E14),\"\",CONCATENATE($E$5,$E14,$E$6)),\"</characteristic>\"),\"\")","v":""}]
[8,null,null,null,null,"変更可","検索不可","必須",null,null,{"$f":"IF(COUNTA($A15:$C15,$F15:$H15)=6,CONCATENATE(VLOOKUP($F15,'(設定シート管理用)リスト'!$Q:$R,2,FALSE),VLOOKUP($G15,'(設定シート管理用)リスト'!$S:$T,2,FALSE),VLOOKUP($H15,'(設定シート管理用)リスト'!$U:$V,2,FALSE),$C$5,$C15,$C$6,$B$5,$B15,$B$6,$A$5,$A15,$A$6,IF(ISBLANK($D15),\"\",CONCATENATE($D$5,$D15,$D$6)),IF(ISBLANK($E15),\"\",CONCATENATE($E$5,$E15,$E$6)),\"</characteristic>\"),\"\")","v":""}]
{"$rows_left_out":111}
{"sheet":"3.関連機能設定（任意）","index":4,"n_rows":144,"n_cols":42,"rows_kept":144,"cut":false,"hidden":false,"merged":[[0,4,0,5],[4,0,24,0],[4,1,24,1],[4,2,4,5],[4,6,4,9],[4,10,4,13],[6,2,6,5],[6,6,6,9],[6,10,6,13],[8,2,8,5],[8,6,8,9],[8,10,8,13],[11,2,11,3],[11,4,11,5],[11,6,11,7],[11,8,11,9],[11,10,11,11],[11,12,11,13],[13,2,13,3],[13,6,13,7],[13,10,13,11],[16,2,16,3],[16,4,16,5],[16,6,16,7],[6,14,6,17],[6,18,6,21],[7,2,7,5],[7,6,7,9],[7,10,7,13],[7,14,7,17],[7,18,7,21],[4,14,4,17],[4,18,4,21],[5,2,5,5],[5,6,5,9],[5,10,5,13],[5,14,5,17],[5,18,5,21],[8,14,8,17],[8,18,8,21],[9,2,9,5],[9,6,9,9],[9,10,9,13],[9,14,9,17],[9,18,9,21],[10,2,10,5],[10,6,10,9],[10,10,10,13],[10,14,10,17],[10,18,10,21],[11,14,11,15],[11,16,11,17],[11,18,11,19],[11,20,11,21],[12,2,12,3],[12,6,12,7],[12,10,12,11],[12,14,12,15],[12,18,12,19],[13,14,13,15],[13,18,13,19],[14,2,14,3],[14,6,14,7],[14,10,14,11],[14,14,14,15],[14,18,14,19],[15,2,15,3],[15,6,15,7],[15,10,15,11],[15,14,15,15],[15,18,15,19],[16,8,16,9],[16,10,16,11],[16,12,16,13],[16,14,16,15],[16,16,16,17],[16,18,16,19],[16,20,16,21],[17,2,17,5],[17,6,17,9],[17,10,17,13],[17,14,17,17],[17,18,17,21],[18,2,18,5],[18,6,18,9],[18,10,18,13],[18,14,18,17],[18,18,18,21],[19,2,19,5],[19,6,19,9],[19,10,19,13],[19,14,19,17],[19,18,19,21],[20,2,20,5],[20,6,20,9],[20,10,20,13],[20,14,20,17],[20,18,20,21],[21,2,21,5],[21,6,21,9],[21,10,21,13],[21,14,21,17],[21,18,21,21],[23,20,23,21],[129,0,137,0],[129,1,137,1],[129,2,129,5],[129,6,129,9],[130,2,130,5],[130,6,130,9],[22,14,22,15],[22,16,22,17],[22,18,22,19],[22,20,22,21],[23,2,23,3],[23,4,23,5],[23,6,23,7],[23,8,23,9],[23,10,23,11],[23,12,23,13],[22,2,22,3],[22,4,22,5],[22,6,22,7],[22,8,22,9],[22,10,22,11],[22,12,22,13],[131,2,131,5],[131,6,131,9],[132,2,132,5],[132,6,132,9],[133,2,133,5],[133,6,133,9],[23,14,23,15],[23,16,23,17],[23,18,23,19],[136,2,136,3],[136,4,136,5],[136,6,136,7],[136,8,136,9],[134,2,134,5],[134,6,134,9],[135,2,135,3],[135,4,135,5],[135,6,135,7],[135,8,135,9]]}
["他のサービスを使用する場合の設定シート",null,null,null,"色の凡例"]
["※使用しないセルは空白とすること（xmlが不正となりアップロードできない恐れがあるため）",null,null,null,"必須","任意"]
[]
["他のサービス設定",{"$f":"HYPERLINK(\"#A\"&ROW($A129),\"記入例はこちら\")","v":"記入例はこちら"}]
["特性表示名\n※設定シート1から自動入力","特性キー情報\n※設定シート1から自動入力","他のサービスキー情報（1）\n※半角256文字まで",null,null,null,"他のサービスキー情報（2）\n※半角256文字まで",null,null,null,"他のサービスキー情報（3）\n※半角256文字まで",null,null,null,"他のサービスキー情報（4）\n※半角256文字まで",null,null,null,"他のサービスキー情報（5）\n※半角256文字まで"]
[null,null,"<key>",null,null,null,"<key>",null,null,null,"<key>",null,null,null,"<key>",null,null,null,"<key>"]
[null,null,"</key>",null,null,null,"</key>",null,null,null,"</key>",null,null,null,"</key>",null,null,null,"</key>"]
[null,null,"<displayName>",null,null,null,"<displayName>",null,null,null,"<displayName>",null,null,null,"<displayName>",null,null,null,"<displayName>"]
[null,null,"</displayName>",null,null,null,"</displayName>",null,null,null,"</displayName>",null,null,null,"</displayName>",null,null,null,"</displayName>"]
[null,null,"<characteristicKey>",null,null,null,"<characteristicKey>",null,null,null,"<characteristicKey>",null,null,null,"<characteristicKey>",null,null,null,"<characteristicKey>"]
[null,null,"</characteristicKey>",null,null,null,"</characteristicKey>",null,null,null,"</characteristicKey>",null,null,null,"</characteristicKey>",null,null,null,"</characteristicKey>",null,null,null,null,null,null,{"$f":"IF(COUNTIF($Z$13:$Z$14,\"\")<>2,CONCATENATE(\"<capabilities>\",Z13,Z14,\"</capabilities>\"),\"\")","v":""}]
[null,null,{"$f":"VLOOKUP(C$22,'(設定シート管理用)リスト'!$C:$H,4,FALSE)","v":{"$error":"#N/A"}},null,"<constraint>",null,{"$f":"VLOOKUP(G$22,'(設定シート管理用)リスト'!$C:$H,4,FALSE)","v":{"$error":"#N/A"}},null,"<constraint>",null,{"$f":"VLOOKUP(K$22,'(設定シート管理用)リスト'!$C:$H,4,FALSE)","v":{"$error":"#N/A"}},null,"<constraint>",null,{"$f":"VLOOKUP(O$22,'(設定シート管理用)リスト'!$C:$H,4,FALSE)","v":{"$error":"#N/A"}},null,"<constraint>",null,{"$f":"VLOOKUP(S$22,'(設定シート管理用)リスト'!$C:$H,4,FALSE)","v":{"$error":"#N/A"}},null,"<constraint>"]
[null,null,{"$f":"VLOOKUP(C$22,'(設定シート管理用)リスト'!$C:$I,6,FALSE)","v":{"$error":"#N/A"}},null,null,null,{"$f":"VLOOKUP(G$22,'(設定シート管理用)リスト'!$C:$I,6,FALSE)","v":{"$error":"#N/A"}},null,null,null,{"$f":"VLOOKUP(K$22,'(設定シート管理用)リスト'!$C:$I,6,FALSE)","v":{"$error":"#N/A"}},null,null,null,{"$f":"VLOOKUP(O$22,'(設定シート管理用)リスト'!$C:$I,6,FALSE)","v":{"$error":"#N/A"}},null,null,null,{"$f":"VLOOKUP(S$22,'(設定シート管理用)リスト'!$C:$I,6,FALSE)","v":{"$error":"#N/A"}},null,null,null,null,null,null,{"$f":"IF(OR(Z16<>\"\",AD16<>\"\",AH16<>\"\",AL16<>\"\",AP16<>\"\"),CONCATENATE(\"<providedCapabilities>\",Z$16,AD$16,AH$16,AL$16,AP$16,\"</providedCapabilities>\"),\"\")","v":""}]
[null,null,{"$f":"VLOOKUP(C$22,'(設定シート管理用)リスト'!$C:$H,2,FALSE)","v":{"$error":"#N/A"}},null,"<type>","<value>",{"$f":"VLOOKUP(G$22,'(設定シート管理用)リスト'!$C:$H,2,FALSE)","v":{"$error":"#N/A"}},null,"<type>","<value>",{"$f":"VLOOKUP(K$22,'(設定シート管理用)リスト'!$C:$H,2,FALSE)","v":{"$error":"#N/A"}},null,"<type>","<value>",{"$f":"VLOOKUP(O$22,'(設定シート管理用)リスト'!$C:$H,2,FALSE)","v":{"$error":"#N/A"}},null,"<type>","<value>",{"$f":"VLOOKUP(S$22,'(設定シート管理用)リスト'!$C:$H,2,FALSE)","v":{"$error":"#N/A"}},null,"<type>","<value>",null,null,null,{"$f":"IF(OR(Z17<>\"\",AD17<>\"\",AH17<>\"\",AL17<>\"\",AP17<>\"\"),CONCATENATE(\"<requiredCapabilities>\",Z$17,AD$17,AH$17,AL$17,AP$17,\"</requiredCapabilities>\"),\"\")","v":""}]
[null,null,{"$f":"VLOOKUP(C$22,'(設定シート管理用)リスト'!$C:$H,3,FALSE)","v":{"$error":"#N/A"}},null,"</type>","</value>",{"$f":"VLOOKUP(G$22,'(設定シート管理用)リスト'!$C:$H,3,FALSE)","v":{"$error":"#N/A"}},null,"</type>","</value>",{"$f":"VLOOKUP(K$22,'(設定シート管理用)リスト'!$C:$H,3,FALSE)","v":{"$error":"#N/A"}},null,"</type>","</value>",{"$f":"VLOOKUP(O$22,'(設定シート管理用)リスト'!$C:$H,3,FALSE)","v":{"$error":"#N/A"}},null,"</type>","</value>",{"$f":"VLOOKUP(S$22,'(設定シート管理用)リスト'!$C:$H,3,FALSE)","v":{"$error":"#N/A"}},null,"</type>","</value>"]
{"$rows_left_out":130}
{"sheet":"4.パラメータ設定（任意）","index":5,"n_rows":35,"n_cols":10,"rows_kept":35,"cut":false,"hidden":false,"merged":[[0,2,0,3]]}
["パラメータを使用する場合の設定シート",null,"色の凡例"]
[null,null,"必須","任意"]
["パラメータ設定",{"$f":"HYPERLINK(\"#A\"&ROW($A25),\"記入例はこちら\")","v":"記入例はこちら"},null,null,null,null,null,null,null,"先頭タグ"]
["未定義パラメータの許容",null,null,null,null,null,null,null,null,{"$f":"VLOOKUP($A$5,'(設定シート管理用)リスト'!$Y:$Z,2,FALSE)","v":"<parameterSet strictValidation=\"false\"><parameterDefinitions>"}]
["許容する"]
[]
["パラメータ定義"]
["<key>","<displayName>",null,"<validationRegex>"]
["</key>","</displayName>",null,"</validationRegex>"]
["パラメータ表示名\n※全角半角256文字まで","パラメータキー情報\n※半角256文字まで","入力の必須・任意","入力チェック","桁数チェック\n（下限）","桁数チェック\n（上限）",null,null,"入力チェック","パラメータ"]
[null,null,"必須",null,null,null,null,null,{"$f":"IF($D11<>\"\",IF(VLOOKUP($D11,入力チェック!A:C,2,FALSE)=\"〇\",CONCATENATE($D$8,\"^(\",VLOOKUP($D11,入力チェック!$A:$C,3,FALSE),\"{\",IF($E11<>\"\",$E11,\"1\"),\",\",IF($F11<>\"\",$F11,\"\"),\"})\",$D$9),CONCATENATE($D$8,VLOOKUP($D11,入力チェック!$A:$C,3,FALSE),$D$9)),\"\")","v":""},{"$f":"IF(AND($A$5<>\"\",$B11<>\"\",$C11<>\"\"),CONCATENATE(VLOOKUP($C11,'(設定シート管理用)リスト'!$W:$X,2,FALSE),$A$8,$B11,$A$9,IF($A11<>\"\",CONCATENATE($B$8,$A11,$B$9),\"\"),$I11,\"</parameterDefinition>\"),\"\")","v":""}]
[null,null,"必須",null,null,null,null,null,{"$f":"IF($D12<>\"\",IF(VLOOKUP($D12,入力チェック!A:C,2,FALSE)=\"〇\",CONCATENATE($D$8,\"^(\",VLOOKUP($D12,入力チェック!$A:$C,3,FALSE),\"{\",IF($E12<>\"\",$E12,\"1\"),\",\",IF($F12<>\"\",$F12,\"\"),\"})\",$D$9),CONCATENATE($D$8,VLOOKUP($D12,入力チェック!$A:$C,3,FALSE),$D$9)),\"\")","v":""},{"$f":"IF(AND($A$5<>\"\",$B12<>\"\",$C12<>\"\"),CONCATENATE(VLOOKUP($C12,'(設定シート管理用)リスト'!$W:$X,2,FALSE),$A$8,$B12,$A$9,IF($A12<>\"\",CONCATENATE($B$8,$A12,$B$9),\"\"),$I12,\"</parameterDefinition>\"),\"\")","v":""}]
[null,null,"必須",null,null,null,null,null,{"$f":"IF($D13<>\"\",IF(VLOOKUP($D13,入力チェック!A:C,2,FALSE)=\"〇\",CONCATENATE($D$8,\"^(\",VLOOKUP($D13,入力チェック!$A:$C,3,FALSE),\"{\",IF($E13<>\"\",$E13,\"1\"),\",\",IF($F13<>\"\",$F13,\"\"),\"})\",$D$9),CONCATENATE($D$8,VLOOKUP($D13,入力チェック!$A:$C,3,FALSE),$D$9)),\"\")","v":""},{"$f":"IF(AND($A$5<>\"\",$B13<>\"\",$C13<>\"\"),CONCATENATE(VLOOKUP($C13,'(設定シート管理用)リスト'!$W:$X,2,FALSE),$A$8,$B13,$A$9,IF($A13<>\"\",CONCATENATE($B$8,$A13,$B$9),\"\"),$I13,\"</parameterDefinition>\"),\"\")","v":""}]
[null,null,"必須",null,null,null,null,null,{"$f":"IF($D14<>\"\",IF(VLOOKUP($D14,入力チェック!A:C,2,FALSE)=\"〇\",CONCATENATE($D$8,\"^(\",VLOOKUP($D14,入力チェック!$A:$C,3,FALSE),\"{\",IF($E14<>\"\",$E14,\"1\"),\",\",IF($F14<>\"\",$F14,\"\"),\"})\",$D$9),CONCATENATE($D$8,VLOOKUP($D14,入力チェック!$A:$C,3,FALSE),$D$9)),\"\")","v":""},{"$f":"IF(AND($A$5<>\"\",$B14<>\"\",$C14<>\"\"),CONCATENATE(VLOOKUP($C14,'(設定シート管理用)リスト'!$W:$X,2,FALSE),$A$8,$B14,$A$9,IF($A14<>\"\",CONCATENATE($B$8,$A14,$B$9),\"\"),$I14,\"</parameterDefinition>\"),\"\")","v":""}]
[null,null,"必須",null,null,null,null,null,{"$f":"IF($D15<>\"\",IF(VLOOKUP($D15,入力チェック!A:C,2,FALSE)=\"〇\",CONCATENATE($D$8,\"^(\",VLOOKUP($D15,入力チェック!$A:$C,3,FALSE),\"{\",IF($E15<>\"\",$E15,\"1\"),\",\",IF($F15<>\"\",$F15,\"\"),\"})\",$D$9),CONCATENATE($D$8,VLOOKUP($D15,入力チェック!$A:$C,3,FALSE),$D$9)),\"\")","v":""},{"$f":"IF(AND($A$5<>\"\",$B15<>\"\",$C15<>\"\"),CONCATENATE(VLOOKUP($C15,'(設定シート管理用)リスト'!$W:$X,2,FALSE),$A$8,$B15,$A$9,IF($A15<>\"\",CONCATENATE($B$8,$A15,$B$9),\"\"),$I15,\"</parameterDefinition>\"),\"\")","v":""}]
{"$rows_left_out":21}
{"sheet":"入力チェック","index":6,"n_rows":18,"n_cols":3,"rows_kept":18,"cut":false,"hidden":false,"merged":[]}
["プルダウン","桁数チェック","正規表現"]
["半角文字",null,"^[ -~｡-ﾟ]*"]
["全角文字",null,"^[^ -~｡-ﾟ]*"]
["全角カナ",null,"^[ァ-ー]*"]
["半角数字",null,"^[0-9]*"]
["半角英字",null,"^[a-zA-Z]*"]
["半角英数",null,"^[0-9a-zA-Z]*"]
["半角英数記号",null,"^[!-~]*"]
["半角文字（桁制限あり）","〇","[ -~｡-ﾟ]"]
["全角文字（桁制限あり）","〇","[^ -~｡-ﾟ]"]
["全角カナ（桁制限あり）","〇","[ァ-ー]"]
["半角数字（桁制限あり）","〇","[0-9]"]
["半角英字（桁制限あり）","〇","[a-zA-Z]"]
["半角英数（桁制限あり）","〇","[0-9a-zA-Z]"]
["半角英数記号（桁制限あり）","〇","[!-~]"]
{"$rows_left_out":4}
{"sheet":"(設定シート管理用)リスト","index":7,"n_rows":7,"n_cols":28,"rows_kept":7,"cut":false,"hidden":true,"merged":[[0,26,0,27],[0,0,0,1],[0,2,0,8],[0,9,0,10],[0,12,0,13],[0,14,0,15],[0,16,0,17],[0,18,0,19],[0,20,0,21],[0,22,0,23],[0,24,0,25]]}
["追加フィルタとしての使用可否",null,"関連サービス",null,null,null,null,null,null,"制約",null,"capability使用","exclusive",null,"requiredToStartProvisioning",null,"オーダ完了後の値変更",null,"検索可否",null,"入力の必須・任意",null,"入力の必須任意",null,"パラメータ",null,"プロビアクション"]
["使用可","<configurationAttribute isSearchable=\"true\">","提供する","<providedProperty>","</providedProperty>","<providedCapability>","</providedCapability>","<providedProperties>","</providedProperties>","に等しい","EQUAL","〇","許可する","exclusive=\"false\" ","提供される特性の入力を待つ","requiredToStartProvisioning=\"true\">","変更可","<characteristic isChangeable=\"true\" ","検索可","isSearchable=\"true\" ","必須","isValueMandatory=\"true\">","必須","<parameterDefinition isRequired=\"true\">","許容する","<parameterSet strictValidation=\"false\"><parameterDefinitions>","即時完了","<resourceProvisioningMethod>success</resourceProvisioningMethod>"]
["使用不可","<configurationAttribute isSearchable=\"false\">","提供される","<requiredProperty>","</requiredProperty>","<requiredCapability ","</requiredCapability>","<requiredProperties>","</requiredProperties>","より大きい","GREATER_THAN",null,"許可しない","exclusive=\"true\" ","提供される特性の入力を待たない","requiredToStartProvisioning=\"false\">","変更不可","<characteristic isChangeable=\"false\" ","検索不可","isSearchable=\"false\" ","任意","isValueMandatory=\"false\">","任意","<parameterDefinition isRequired=\"false\">","許容しない","<parameterSet strictValidation=\"true\"><parameterDefinitions>","タスク","<resourceProvisioningMethod>task</resourceProvisioningMethod>"]
[null,null,null,null,null,null,null,null,null,"以上","GREATER_OR_EQUAL",null,null,null,null,null,null,null,null,null,null,null,null,null,null,null,"他システム連携","<resourceProvisioningMethod>resourceordering_v1</resourceProvisioningMethod>"]
[null,null,null,null,null,null,null,null,null,"より小さい","LESS_THAN"]
[null,null,null,null,null,null,null,null,null,"以下","LESS_OR_EQUAL"]
[null,null,null,null,null,null,null,null,null,"のいずれかと等しい","VALID_VALUES"]