{"text_format":"1","workbook":"xlsx","n_sheets":8,"sheets":["はじめに","変更履歴","1.リソース設定（必須）","2.特性設定（任意）","3.関連機能設定（任意）","4.パラメータ設定（任意）","入力チェック","(設定シート管理用)リスト"],"not_rendered":{"charts":0,"images":1,"macros":1,"external_links":0,"defined_names":1,"comments":1,"pivot_tables":0},"unopened":[],"bounds":{"document_bytes":16777216,"sheet_cells":100000,"rows_first":2000,"rows_last":500,"rows_between":2000,"halvings":0,"cell_chars":16384,"cell_head_chars":4096},"cells_cut":0,"cells_raw":0,"read":"whole","date_system":"1900"}

{"sheet":"はじめに","index":0,"n_rows":48,"n_cols":5,"rows_kept":48,"cut":false,"hidden":false,"merged":[[5,1,5,2],[5,4,5,10],[6,1,6,2],[6,4,6,10],[2,1,2,2],[2,4,2,10],[3,1,3,2],[3,4,3,10],[4,1,4,2],[4,4,4,10]]}
[]
["＜リソース情報 設定シートの記入の仕方＞"]
[null,"シート名",null,"必須/任意","説明"]
[null,"1.リソース設定（必須）",null,"必須","リソース登録に必要なテンプレートの情報と、登録するリソースの情報を記入します。\n設定可能は項目数は最大100となっておりますが、100を超える場合はご相談ください。"]
[null,"2.特性設定（任意）",null,"任意","テンプレートに付随する特性を使用する場合、記入が必要となります。\n設定可能はSELCET属性の特性は最大20となっておりますが、20を超える場合はご相談ください。"]
[null,"3.関連機能設定（任意）",null,"任意","関連機能を使用する場合、記入が必要となります。"]
[null,"4.パラメータ設定（任意）",null,"任意","パラメータを利用する場合、記入が必要となります。"]
[]
[]
["＜xmlの中身の生成＞"]
[null,"①「XML出力」ボタンを押下し、保存します"]
[]
["＜入力チェックのプルダウンに項目を追加する手順＞"]
[null,"①入力チェックシートのA列にプルダウンで表示される項目名を入力します"]
[null,"②入力チェックシートのC列に正規表現を入力します"]
{"$rows_left_out":34}
{"sheet":"変更履歴","index":1,"n_rows":6,"n_cols":5,"rows_kept":6,"cut":false,"hidden":false,"merged":[]}
["<変更履歴>"]
[]
[null,"Ver","更新日","更新シート","更新内容"]
[null,1,"2021-08-26",null,"新規作成"]
[null,1,"2021-09-13","はじめに","＜商品概念図＞を追加\n\n＜商品設定フロー＞を追加"]
[null,1,"2022-02-02","入力チェック","以下の正規表現を変更\n・郵便番号（ハイフンなし）"]

{"sheet":"1.リソース設定（必須）","index":2,"n_rows":195,"n_cols":48,"rows_kept":195,"cut":false,"hidden":false,"merged":[[1,2,1,3]]}
[]
[null,null,"色の凡例"]
[null,null,"必須","任意"]
[]
["テンプレート設定",{"$f":"HYPERLINK(\"#A\"&ROW($A161),\"記入例はこちら\")","v":"記入例はこちら"}]
["<displayName>","<key>","<description>"]
["</displayName>","</key>","</description>"]
["テンプレート表示名\n※全角半角64文字まで","テンプレートキー情報\n※半角32文字まで","テンプレート説明\n※全角半角1024文字まで",null,null,null,null,null,null,null,null,null,null,null,null,null,null,null,null,null,null,null,null,null,null,null,"テンプレート"]
[null,null,null,null,null,null,null,null,null,null,null,null,null,null,null,null,null,null,null,null,null,null,null,null,null,null,{"$f":"CONCATENATE($B$6,$B$9,$B$7,$C$6,$C$9,$C$7,$A$6,$A$9,$A$7)","v":"<key></key><description></description><displayName></displayName>"}]
[]
["プロビジョニング設定"]
["<resourceActions>","</resourceActions>","<resourceAction>","</resourceAction>"]
["<targetSystem>"]
["</targetSystem>","<resourceProvisioningTypeKey>NEW</resourceProvisioningTypeKey>","<resourceProvisioningTypeKey>UPDATE</resourceProvisioningTypeKey>","<resourceProvisioningTypeKey>TERMINATE</resourceProvisioningTypeKey>"]
["<resourcePath>",{"$f":"IF(NOT(ISBLANK(B$18)),VLOOKUP(B$18,'(設定シート管理用)リスト'!$AA:$AB,2,FALSE),\"\")","v":"<resourceProvisioningMethod>task</resourceProvisioningMethod>"},{"$f":"IF(NOT(ISBLANK(C$18)),VLOOKUP(C$18,'(設定シート管理用)リスト'!$AA:$AB,2,FALSE),\"\")","v":"<resourceProvisioningMethod>task</resourceProvisioningMethod>"},{"$f":"IF(NOT(ISBLANK(D$18)),VLOOKUP(D$18,'(設定シート管理用)リスト'!$AA:$AB,2,FALSE),\"\")","v":"<resourceProvisioningMethod>task</resourceProvisioningMethod>"}]
{"$rows_left_out":181}
{"sheet":"2.特性設定（任意）","index":3,"n_rows":125,"n_cols":11,"rows_kept":125,"cut":false,"hidden":false,"merged":[[0,2,0,3]]}
["特性を使用する場合の設定シート",null,"色の凡例"]
[null,null,"必須","任意"]
[]
["特性設定",{"$f":"HYPERLINK(\"#A\"&ROW($A116),\"記入例はこちら\")","v":"記入例はこちら"}]
["<displayOrder>","<displayName>","<characteristicKey>","<description>","<defaultValue>"]
["</displayOrder>","</displayName>","</characteristicKey>","</description>","</defaultValue>"]
["表示順","特性表示名\n※全角半角64文字まで","特性キー情報\n※半角32文字まで","説明\n※全角半角1024文字まで","デフォルト値\n※全角半角128文字まで","オーダ完了後の値変更","検索可否","入力の必須・任意",null,null,"特性結合列"]
[1,null,null,null,null,"変更可","検索不可","必須",null,null,{"$f":"IF(COUNTA($A8:$C8,$F8:$H8)=6,CONCATENATE(VLOOKUP($F8,'(設定シート管理用)リスト'!$Q:$R,2,FALSE),VLOOKUP($G8,'(設定シート管理用)リスト'!$S:$T,2,FALSE),VLOOKUP($H8,'(設定シート管理用)リスト'!$U:$V,2,FALSE),$C$5,$C8,$C$6,$B$5,$B8,$B$6,$A$5,$A8,$A$6,IF(ISBLANK($D8),\"\",CONCATENATE($D$5,$D8,$D$6)),IF(ISBLANK($E8),\"\",CONCATENATE($E$5,$E8,$E$6)),\"</characteristic>\"),\"\")","v":""}]
[2,null,null,null,null,"変更可","検索不可","必須",null,null,{"$f":"IF(COUNTA($A9:$C9,$F9:$H9)=6,CONCATENATE(VLOOKUP($F9,'(設定シート管理用)リスト'!$Q:$R,2,FALSE),VLOOKUP($G9,'(設定シート管理用)リスト'!$S:$T,2,FALSE),VLOOKUP($H9,'(設定シート管理用)リスト'!$U:$V,2,FALSE),$C$5,$C9,$C$6,$B$5,$B9,$B$6,$A$5,$A9,$A$6,IF(ISBLANK($D9),\"\",CONCATENATE($D$5,$D9,$D$6)),IF(ISBLANK($E9),\"\",CONCATENATE($E$5,$E9,$E$6)),\"</characteristic>\"),\"\")","v":""}]
[3,null,null,null,null,"変更可","検索不可","必須",null,null,{"$f":"IF(COUNTA($A10:$C10,$F10:$H10)=6,CONCATENATE(VLOOKUP($F10,'(設定シート管理用)リスト'!$Q:$R,2,FALSE),VLOOKUP($G10,'(設定シート管理用)リスト'!$S:$T,2,FALSE),VLOOKUP($H10,'(設定シート管理用)リスト'!$U:$V,2,FALSE),$C$5,$C10,$C$6,$B$5,$B10,$B$6,$A$5,$A10,$A$6,IF(ISBLANK($D10),\"\",CONCATENATE($D$5,$D10,$D$6)),IF(ISBLANK($E10),\"\",CONCATENATE($E$5,$E10,$E$6)),\"</characteristic>\"),\"\")","v":""}]
[4,null,null,null,null,"変更可","検索不可","必須",null,null,{"$f":"IF(COUNTA($A11:$C11,$F11:$H11)=6,CONCATENATE(VLOOKUP($F11,'(設定シート管理用)リスト'!$Q:$R,2,FALSE),VLOOKUP($G11,'(設定シート管理用)リスト'!$S:$T,2,FALSE),VLOOKUP($H11,'(設定シート管理用)リスト'!$U:$V,2,FALSE),$C$5,$C11,$C$6,$B$5,$B11,$B$6,$A$5,$A11,$A$6,IF(ISBLANK($D11),\"\",CONCATENATE($D$5,$D11,$D$6)),IF(ISBLANK($E11),\"\",CONCATENATE($E$5,$E11,$E$6)),\"</characteristic>\"),\"\")","v":""}]
[5,null,null,null,null,"変更可","検索不可","必須",null,null,{"$f":"IF(COUNTA($A12:$C12,$F12:$H12)=6,CONCATENATE(VLOOKUP($F12,'(設定シート管理用)リスト'!$Q:$R,2,FALSE),VLOOKUP($G12,'(設定シート管理用)リスト'!$S:$T,2,FALSE),VLOOKUP($H12,'(設定シート管理用)リスト'!$U:$V,2,FALSE),$C$5,$C12,$C$6,$B$5,$B12,$B$6,$A$5,$A12,$A$6,IF(ISBLANK($D12),\"\",CONCATENATE($D$5,$D12,$D$6)),IF(ISBLANK($E12),\"\",CONCATENATE($E$5,$E12,$E$6)),\"</characteristic>\"),\"\")","v":""}]
[6,null,null,null,null,"変更可","検索不可","必須",null,null,{"$f":"IF(COUNTA($A13:$C13,$F13:$H13)=6,CONCATENATE(VLOOKUP($F13,'(設定シート管理用)リスト'!$Q:$R,2,FALSE),VLOOKUP($G13,'(設定シート管理用)リスト'!$S:$T,2,FALSE),VLOOKUP($H13,'(設定シート管理用)リスト'!$U:$V,2,FALSE),$C$5,$C13,$C$6,$B$5,$B13,$B$6,$A$5,$A13,$A$6,IF(ISBLANK($D13),\"\",CONCATENATE($D$5,$D13,$D$6)),IF(ISBLANK($E13),\"\",CONCATENATE($E$5,$E13,$E$6)),\"</characteristic>\"),\"\")","v":""}]
[7,null,null,null,null,"変更可","検索不可","必須",null,null,{"$f":"IF(COUNTA($A14:$C14,$F14:$H14)=6,CONCATENATE(VLOOKUP($F14,'(設定シート管理用)リスト'!$Q:$R,2,FALSE),VLOOKUP($G14,'(設定シート管理用)リスト'!$S:$T,2,FALSE),VLOOKUP($H14,'(設定シート管理用)リスト'!$U:$V,2,FALSE),$C$5,$C14,$C$6,$B$5,$B14,$B$6,$A$5,$A14,$A$6,IF(ISBLANK($D14),\"\",CONCATENATE($D$5,$D14,$D$6)),IF(ISBLANK($E14),\"\",CONCATENATE($E$5,$E14,$E$6)),\"</characteristic>\"),\"\")","v":""}]
[8,null,null,null,null,"変更可","検索不可","必須",null,null,{"$f":"IF(COUNTA($A15:$C15,$F15:$H15)=6,CONCATENATE(VLOOKUP($F15,'(設定シート管理用)リスト'!$Q:$R,2,FALSE),VLOOKUP($G15,'(設定シート管理用)リスト'!$S:$T,2,FALSE),VLOOKUP($H15,'(設定シート管理用)リスト'!$U:$V,2,FALSE),$C$5,$C15,$C$6,$B$5,$B15,$B$6,$A$5,$A15,$A$6,IF(ISBLANK($D15),\"\",CONCATENATE($D$5,$D15,$D$6)),IF(ISBLANK($E15),\"\",CONCATENATE($E$5,$E15,$E$6)),\"</characteristic>\"),\"\")","v":""}]
{"$rows_left_out":111}
{"sheet":"3.関連機能設定（任意）","index":4,"n_rows":138,"n_cols":33,"rows_kept":138,"cut":false,"hidden":false,"merged":[[128,5,128,7],[129,5,129,7],[130,5,130,7],[131,5,131,7],[0,3,0,4],[4,0,22,0],[4,1,22,1],[4,2,4,4],[4,5,4,7],[6,2,6,4],[6,5,6,7],[8,2,8,4],[8,5,8,7],[11,3,11,4],[11,6,11,7],[17,2,17,4],[17,5,17,7],[19,2,19,4],[19,5,19,7],[4,11,4,13],[4,14,4,16],[5,2,5,4],[5,5,5,7],[5,8,5,10],[5,11,5,13],[5,14,5,16],[4,8,4,10],[6,11,6,13],[6,14,6,16],[7,2,7,4],[7,5,7,7],[7,8,7,10],[7,11,7,13],[7,14,7,16],[6,8,6,10],[8,8,8,10],[8,11,8,13],[8,14,8,16],[9,2,9,4],[9,5,9,7],[9,8,9,10],[9,11,9,13],[9,14,9,16],[11,9,11,10],[11,12,11,13],[11,15,11,16],[10,2,10,4],[10,5,10,7],[10,8,10,10],[10,11,10,13],[10,14,10,16],[17,8,17,10],[17,11,17,13],[17,14,17,16],[16,3,16,4],[16,6,16,7],[16,9,16,10],[16,12,16,13],[16,15,16,16],[19,8,19,10],[19,11,19,13],[19,14,19,16],[18,2,18,4],[18,5,18,7],[18,8,18,10],[18,11,18,13],[18,14,18,16],[128,0,134,0],[128,1,134,1],[128,2,128,4],[129,2,129,4],[130,2,130,4],[131,2,131,4]]}
["関連機能を使用する場合の設定シート",null,null,"色の凡例"]
[null,null,null,"必須","任意"]
[]
["関連機能設定",{"$f":"HYPERLINK(\"#A\"&ROW($A127),\"記入例はこちら\")","v":"記入例はこちら"}]
["特性表示名\n※2.特性設定（任意）から自動入力","特性キー情報\n※2.特性設定（任意）から自動入力","関連機能キー情報（1）\n※半角256文字まで",null,null,"関連機能キー情報（2）\n※半角256文字まで",null,null,"関連機能キー情報（3）\n※半角256文字まで",null,null,"関連機能キー情報（4）\n※半角256文字まで",null,null,"関連機能キー情報（5）\n※半角256文字まで"]
[null,null,"<key>",null,null,"<key>",null,null,"<key>",null,null,"<key>",null,null,"<key>"]
[null,null,"</key>",null,null,"</key>",null,null,"</key>",null,null,"</key>",null,null,"</key>"]
[null,null,"<displayName>",null,null,"<displayName>",null,null,"<displayName>",null,null,"<displayName>",null,null,"<displayName>"]
[null,null,"</displayName>",null,null,"</displayName>",null,null,"</displayName>",null,null,"</displayName>",null,null,"</displayName>"]
[null,null,"<characteristicKey>",null,null,"<characteristicKey>",null,null,"<characteristicKey>",null,null,"<characteristicKey>",null,null,"<characteristicKey>"]
[null,null,"</characteristicKey>",null,null,"</characteristicKey>",null,null,"</characteristicKey>",null,null,"</characteristicKey>",null,null,"</characteristicKey>",null,null,null,null,null,{"$f":"IF(COUNTIF($U$13:$U$14,\"\")<>2,CONCATENATE(\"<capabilities>\",U13,U14,\"</capabilities>\"),\"\")","v":""}]
[null,null,{"$f":"VLOOKUP(C$22,'(設定シート管理用)リスト'!$C:$H,4,FALSE)","v":{"$error":"#N/A"}},"<constraint>",null,{"$f":"VLOOKUP(F$22,'(設定シート管理用)リスト'!$C:$H,4,FALSE)","v":{"$error":"#N/A"}},"<constraint>",null,{"$f":"VLOOKUP(I$22,'(設定シート管理用)リスト'!$C:$H,4,FALSE)","v":{"$error":"#N/A"}},"<constraint>",null,{"$f":"VLOOKUP(L$22,'(設定シート管理用)リスト'!$C:$H,4,FALSE)","v":{"$error":"#N/A"}},"<constraint>",null,{"$f":"VLOOKUP(O$22,'(設定シート管理用)リスト'!$C:$H,4,FALSE)","v":{"$error":"#N/A"}},"<constraint>"]
[null,null,{"$f":"VLOOKUP(C$22,'(設定シート管理用)リスト'!$C:$I,6,FALSE)","v":{"$error":"#N/A"}},null,null,{"$f":"VLOOKUP(F$22,'(設定シート管理用)リスト'!$C:$I,6,FALSE)","v":{"$error":"#N/A"}},null,null,{"$f":"VLOOKUP(I$22,'(設定シート管理用)リスト'!$C:$I,6,FALSE)","v":{"$error":"#N/A"}},null,null,{"$f":"VLOOKUP(L$22,'(設定シート管理用)リスト'!$C:$I,6,FALSE)","v":{"$error":"#N/A"}},null,null,{"$f":"VLOOKUP(O$22,'(設定シート管理用)リスト'!$C:$I,6,FALSE)","v":{"$error":"#N/A"}},null,null,null,null,null,{"$f":"IF(OR(U16<>\"\",X16<>\"\",AA16<>\"\",AD16<>\"\",AG16<>\"\"),CONCATENATE(\"<providedCapabilities>\",U$16,X$16,AA$16,AD$16,AG$16,\"</providedCapabilities>\"),\"\")","v":""}]
[null,null,{"$f":"VLOOKUP(C$22,'(設定シート管理用)リスト'!$C:$H,2,FALSE)","v":{"$error":"#N/A"}},"<type>","<value>",{"$f":"VLOOKUP(F$22,'(設定シート管理用)リスト'!$C:$H,2,FALSE)","v":{"$error":"#N/A"}},"<type>","<value>",{"$f":"VLOOKUP(I$22,'(設定シート管理用)リスト'!$C:$H,2,FALSE)","v":{"$error":"#N/A"}},"<type>","<value>",{"$f":"VLOOKUP(L$22,'(設定シート管理用)リスト'!$C:$H,2,FALSE)","v":{"$error":"#N/A"}},"<type>","<value>",{"$f":"VLOOKUP(O$22,'(設定シート管理用)リスト'!$C:$H,2,FALSE)","v":{"$error":"#N/A"}},"<type>","<value>",null,null,null,{"$f":"IF(OR(U17<>\"\",X17<>\"\",AA17<>\"\",AD17<>\"\",AG17<>\"\"),CONCATENATE(\"<requiredCapabilities>\",U$17,X$17,AA$17,AD$17,AG$17,\"</requiredCapabilities>\"),\"\")","v":""}]
[null,null,{"$f":"VLOOKUP(C$22,'(設定シート管理用)リスト'!$C:$H,3,FALSE)","v":{"$error":"#N/A"}},"</type>","</value>",{"$f":"VLOOKUP(F$22,'(設定シート管理用)リスト'!$C:$H,3,FALSE)","v":{"$error":"#N/A"}},"</type>","</value>",{"$f":"VLOOKUP(I$22,'(設定シート管理用)リスト'!$C:$H,3,FALSE)","v":{"$error":"#N/A"}},"</type>","</value>",{"$f":"VLOOKUP(L$22,'(設定シート管理用)リスト'!$C:$H,3,FALSE)","v":{"$error":"#N/A"}},"</type>","</value>",{"$f":"VLOOKUP(O$22,'(設定シート管理用)リスト'!$C:$H,3,FALSE)","v":{"$error":"#N/A"}},"</type>","</value>"]
{"$rows_left_out":124}
{"sheet":"4.パラメータ設定（任意）","index":5,"n_rows":35,"n_cols":10,"rows_kept":35,"cut":false,"hidden":false,"merged":[[0,2,0,3]]}
["パラメータを使用する場合の設定シート",null,"色の凡例"]
[null,null,"必須","任意"]
["パラメータ設定",{"$f":"HYPERLINK(\"#A\"&ROW($A25),\"記入例はこちら\")","v":"記入例はこちら"},null,null,null,null,null,null,null,"先頭タグ"]
["未定義パラメータの許容",null,null,null,null,null,null,null,null,{"$f":"VLOOKUP($A$5,'(設定シート管理用)リスト'!$Y:$Z,2,FALSE)","v":"<parameterSet strictValidation=\"false\"><parameterDefinitions>"}]
["許容する"]
[]
["パラメータ定義"]
["<key>","<displayName>",null,"<validationRegex>"]
["</key>","</displayName>",null,"</validationRegex>"]
["パラメータ表示名\n※全角半角256文字まで","パラメータキー情報\n※半角256文字まで","入力の必須・任意","入力チェック","桁数チェック\n（下限）","桁数チェック\n（上限）",null,null,"入力チェック","パラメータ"]
[null,null,"必須",null,null,null,null,null,{"$f":"IF($D11<>\"\",IF(VLOOKUP($D11,入力チェック!A:C,2,FALSE)=\"〇\",CONCATENATE($D$8,\"^(\",VLOOKUP($D11,入力チェック!$A:$C,3,FALSE),\"{\",IF($E11<>\"\",$E11,\"1\"),\",\",IF($F11<>\"\",$F11,\"\"),\"})\",$D$9),CONCATENATE($D$8,VLOOKUP($D11,入力チェック!$A:$C,3,FALSE),$D$9)),\"\")","v":""},{"$f":"IF(AND($A$5<>\"\",$B11<>\"\",$C11<>\"\"),CONCATENATE(VLOOKUP($C11,'(設定シート管理用)リスト'!$W:$X,2,FALSE),$A$8,$B11,$A$9,IF($A11<>\"\",CONCATENATE($B$8,$A11,$B$9),\"\"),$I11,\"</parameterDefinition>\"),\"\")","v":""}]
[null,null,"必須",null,null,null,null,null,{"$f":"IF($D12<>\"\",IF(VLOOKUP($D12,入力チェック!A:C,2,FALSE)=\"〇\",CONCATENATE($D$8,\"^(\",VLOOKUP($D12,入力チェック!$A:$C,3,FALSE),\"{\",IF($E12<>\"\",$E12,\"1\"),\",\",IF($F12<>\"\",$F12,\"\"),\"})\",$D$9),CONCATENATE($D$8,VLOOKUP($D12,入力チェック!$A:$C,3,FALSE),$D$9)),\"\")","v":""},{"$f":"IF(AND($A$5<>\"\",$B12<>\"\",$C12<>\"\"),CONCATENATE(VLOOKUP($C12,'(設定シート管理用)リスト'!$W:$X,2,FALSE),$A$8,$B12,$A$9,IF($A12<>\"\",CONCATENATE($B$8,$A12,$B$9),\"\"),$I12,\"</parameterDefinition>\"),\"\")","v":""}]
[null,null,"必須",null,null,null,null,null,{"$f":"IF($D13<>\"\",IF(VLOOKUP($D13,入力チェック!A:C,2,FALSE)=\"〇\",CONCATENATE($D$8,\"^(\",VLOOKUP($D13,入力チェック!$A:$C,3,FALSE),\"{\",IF($E13<>\"\",$E13,\"1\"),\",\",IF($F13<>\"\",$F13,\"\"),\"})\",$D$9),CONCATENATE($D$8,VLOOKUP($D13,入力チェック!$A:$C,3,FALSE),$D$9)),\"\")","v":""},{"$f":"IF(AND($A$5<>\"\",$B13<>\"\",$C13<>\"\"),CONCATENATE(VLOOKUP($C13,'(設定シート管理用)リスト'!$W:$X,2,FALSE),$A$8,$B13,$A$9,IF($A13<>\"\",CONCATENATE($B$8,$A13,$B$9),\"\"),$I13,\"</parameterDefinition>\"),\"\")","v":""}]
[null,null,"必須",null,null,null,null,null,{"$f":"IF($D14<>\"\",IF(VLOOKUP($D14,入力チェック!A:C,2,FALSE)=\"〇\",CONCATENATE($D$8,\"^(\",VLOOKUP($D14,入力チェック!$A:$C,3,FALSE),\"{\",IF($E14<>\"\",$E14,\"1\"),\",\",IF($F14<>\"\",$F14,\"\"),\"})\",$D$9),CONCATENATE($D$8,VLOOKUP($D14,入力チェック!$A:$C,3,FALSE),$D$9)),\"\")","v":""},{"$f":"IF(AND($A$5<>\"\",$B14<>\"\",$C14<>\"\"),CONCATENATE(VLOOKUP($C14,'(設定シート管理用)リスト'!$W:$X,2,FALSE),$A$8,$B14,$A$9,IF($A14<>\"\",CONCATENATE($B$8,$A14,$B$9),\"\"),$I14,\"</parameterDefinition>\"),\"\")","v":""}]
[null,null,"必須",null,null,null,null,null,{"$f":"IF($D15<>\"\",IF(VLOOKUP($D15,入力チェック!A:C,2,FALSE)=\"〇\",CONCATENATE($D$8,\"^(\",VLOOKUP($D15,入力チェック!$A:$C,3,FALSE),\"{\",IF($E15<>\"\",$E15,\"1\"),\",\",IF($F15<>\"\",$F15,\"\"),\"})\",$D$9),CONCATENATE($D$8,VLOOKUP($D15,入力チェック!$A:$C,3,FALSE),$D$9)),\"\")","v":""},{"$f":"IF(AND($A$5<>\"\",$B15<>\"\",$C15<>\"\"),CONCATENATE(VLOOKUP($C15,'(設定シート管理用)リスト'!$W:$X,2,FALSE),$A$8,$B15,$A$9,IF($A15<>\"\",CONCATENATE($B$8,$A15,$B$9),\"\"),$I15,\"</parameterDefinition>\"),\"\")","v":""}]
{"$rows_left_out":21}
{"sheet":"入力チェック","index":6,"n_rows":18,"n_cols":3,"rows_kept":18,"cut":false,"hidden":false,"merged":[]}
["プルダウン","桁数チェック","正規表現"]
["半角文字",null,"^[ -~｡-ﾟ]*"]
["全角文字",null,"^[^ -~｡-ﾟ]*"]
["全角カナ",null,"^[ァ-ー]*"]
["半角数字",null,"^[0-9]*"]
["半角英字",null,"^[a-zA-Z]*"]
["半角英数",null,"^[0-9a-zA-Z]*"]
["半角英数記号",null,"^[!-~]*"]
["半角文字（桁制限あり）","〇","[ -~｡-ﾟ]"]
["全角文字（桁制限あり）","〇","[^ -~｡-ﾟ]"]
["全角カナ（桁制限あり）","〇","[ァ-ー]"]
["半角数字（桁制限あり）","〇","[0-9]"]
["半角英字（桁制限あり）","〇","[a-zA-Z]"]
["半角英数（桁制限あり）","〇","[0-9a-zA-Z]"]
["半角英数記号（桁制限あり）","〇","[!-~]"]
{"$rows_left_out":4}
{"sheet":"(設定シート管理用)リスト","index":7,"n_rows":7,"n_cols":28,"rows_kept":7,"cut":false,"hidden":true,"merged":[[0,26,0,27],[0,0,0,1],[0,2,0,8],[0,9,0,10],[0,12,0,13],[0,14,0,15],[0,16,0,17],[0,18,0,19],[0,20,0,21],[0,22,0,23],[0,24,0,25]]}
["検索可否",null,"関連サービス",null,null,null,null,null,null,"制約",null,"capability使用","exclusive",null,"requiredToStartProvisioning",null,"オーダ完了後の値変更",null,"検索可否",null,"入力の必須・任意",null,"入力の必須任意",null,"パラメータ",null,"プロビアクション"]
["検索可","<configurationAttribute isSearchable=\"true\">","提供する","<providedProperty>","</providedProperty>","<providedCapability>","</providedCapability>","<providedProperties>","</providedProperties>","に等しい","EQUAL","〇","許可する","exclusive=\"false\" ","提供される特性の入力を待つ","requiredToStartProvisioning=\"true\">","変更可","<characteristic isChangeable=\"true\" ","検索可","isSearchable=\"true\" ","必須","isValueMandatory=\"true\">","必須","<parameterDefinition isRequired=\"true\">","許容する","<parameterSet strictValidation=\"false\"><parameterDefinitions>","即時完了","<resourceProvisioningMethod>success</resourceProvisioningMethod>"]
["検索不可","<configurationAttribute isSearchable=\"false\">","提供される","<requiredProperty>","</requiredProperty>","<requiredCapability ","</requiredCapability>","<requiredProperties>","</requiredProperties>","より大きい","GREATER_THAN",null,"許可しない","exclusive=\"true\" ","提供される特性の入力を待たない","requiredToStartProvisioning=\"false\">","変更不可","<characteristic isChangeable=\"false\" ","検索不可","isSearchable=\"false\" ","任意","isValueMandatory=\"false\">","任意","<parameterDefinition isRequired=\"false\">","許容しない","<parameterSet strictValidation=\"true\"><parameterDefinitions>","タスク","<resourceProvisioningMethod>task</resourceProvisioningMethod>"]
[null,null,null,null,null,null,null,null,null,"以上","GREATER_OR_EQUAL",null,null,null,null,null,null,null,null,null,null,null,null,null,null,null,"他システム連携","<resourceProvisioningMethod>resourceordering_v1</resourceProvisioningMethod>"]
[null,null,null,null,null,null,null,null,null,"より小さい","LESS_THAN"]
[null,null,null,null,null,null,null,null,null,"以下","LESS_OR_EQUAL"]
[null,null,null,null,null,null,null,null,null,"のいずれかと等しい","VALID_VALUES"]